BDBM50199368 (9R,12R,15S)-12-isopropyl-9-(4-methoxy-benzyl)-15-propyl-6,7,8,9,11,12,14,15,17,18,19,20-dodecahydro-5-oxa-8,11,14,17-tetraaza-benzocyclooctadecene-10,13,16-trione::CHEMBL384501
SMILES CCC[C@@H]1NC(=O)[C@H](NC(=O)[C@@H](Cc2ccc(OC)cc2)NCCOc2ccccc2CCCNC1=O)C(C)C
InChI Key InChIKey=BNIYEGMNETZYGX-ZRRKCSAHSA-N
Data  1 KI  1 IC50
  Tab Delimited (TSV)   2D SDfile   Computed 3D by Vconf -m prep SDfile
Find this compound or compounds like it in BindingDB:
Activity Spreadsheet -- Enzyme Inhibition Constant Data from BindingDB
Found 2 hits for monomerid = 50199368
TargetMotilin receptor(Homo sapiens (Human))
Tranzyme Pharma
Curated by ChEMBL
LigandPNGBDBM50199368((9R,12R,15S)-12-isopropyl-9-(4-methoxy-benzyl)-15-...)
Affinity DataKi:  8nM. Assay description: Displacement of [125I]motilin from human MOTR
In DepthDetails ArticlePubMed
TargetMotilin receptor(Homo sapiens (Human))
Tranzyme Pharma
Curated by ChEMBL
LigandPNGBDBM50199368((9R,12R,15S)-12-isopropyl-9-(4-methoxy-benzyl)-15-...)
Affinity DataIC50:  23nM. Assay description: Activity at human MOTR expressed in CHO cells assessed as inhibition of motilin-induced calcium release
In DepthDetails ArticlePubMed