BDBM50199374 (E/Z)-(9R,12R,15S)-9-(4-hydroxy-benzyl)-12-isopropyl-15-propyl-5,6,7,8,9,11,12,14,15,17,18,19-dodecahydro-8,11,14,17-tetraaza-benzocyclononadecene-10,13,16-trione::CHEMBL425988
SMILES CCC[C@@H]1NC(=O)[C@H](NC(=O)[C@@H](Cc2ccc(O)cc2)NCCCc2ccccc2\C=C/CCNC1=O)C(C)C
InChI Key InChIKey=VYVBZYJZUNXCLJ-CHTLNIFZSA-N
Data  1 KI
  Tab Delimited (TSV)   2D SDfile   Computed 3D by Vconf -m prep SDfile
Find this compound or compounds like it in BindingDB:
Activity Spreadsheet -- Enzyme Inhibition Constant Data from BindingDB
Found 1 hit for monomerid = 50199374
TargetMotilin receptor(Homo sapiens (Human))
Tranzyme Pharma
Curated by ChEMBL
LigandPNGBDBM50199374((E/Z)-(9R,12R,15S)-9-(4-hydroxy-benzyl)-12-isoprop...)
Affinity DataKi:  7.30E+3nM. Assay description: Displacement of [125I]motilin from human MOTR
In DepthDetails ArticlePubMed