BDBM50199387 (9R,12R,15S)-9-(4-hydroxy-benzyl)-12-isopropyl-11-methyl-15-propyl-6,7,8,9,11,12,14,15,17,18,19,20-dodecahydro-5-oxa-8,11,14,17-tetraaza-benzocyclooctadecene-10,13,16-trione::CHEMBL387033
SMILES CCC[C@@H]1NC(=O)[C@@H](C(C)C)N(C)C(=O)[C@@H](Cc2ccc(O)cc2)NCCOc2ccccc2CCCNC1=O
InChI Key InChIKey=WQRLYQHCZSUFGF-ZRRKCSAHSA-N
Data  1 KI
  Tab Delimited (TSV)   2D SDfile   Computed 3D by Vconf -m prep SDfile
Find this compound or compounds like it in BindingDB:
Activity Spreadsheet -- Enzyme Inhibition Constant Data from BindingDB
Found 1 hit for monomerid = 50199387
TargetMotilin receptor(Homo sapiens (Human))
Tranzyme Pharma
Curated by ChEMBL
LigandPNGBDBM50199387((9R,12R,15S)-9-(4-hydroxy-benzyl)-12-isopropyl-11-...)
Affinity DataKi: >1.00E+4nM. Assay description: Displacement of [125I]motilin from human MOTR
In DepthDetails ArticlePubMed