BDBM50199392 (9R,12R,15S)-9-(4-hydroxy-benzyl)-15-isobutyl-12-isopropyl-14-methyl-6,7,8,9,11,12,14,15,17,18,19,20-dodecahydro-5-oxa-8,11,14,17-tetraaza-benzocyclooctadecene-10,13,16-trione::CHEMBL214570
SMILES CC(C)C[C@@H]1N(C)C(=O)[C@H](NC(=O)[C@@H](Cc2ccc(O)cc2)NCCOc2ccccc2CCCNC1=O)C(C)C
InChI Key InChIKey=NHQNHINOQQUCII-IUAQSZDVSA-N
Data  1 KI
  Tab Delimited (TSV)   2D SDfile   Computed 3D by Vconf -m prep SDfile
Find this compound or compounds like it in BindingDB:
Activity Spreadsheet -- Enzyme Inhibition Constant Data from BindingDB
Found 1 hit for monomerid = 50199392
TargetMotilin receptor(Homo sapiens (Human))
Tranzyme Pharma
Curated by ChEMBL
LigandPNGBDBM50199392((9R,12R,15S)-9-(4-hydroxy-benzyl)-15-isobutyl-12-i...)
Affinity DataKi:  222nM. Assay description: Displacement of [125I]motilin from human MOTR
In DepthDetails ArticlePubMed