BDBM50199892 CHEMBL3889874
SMILES COc1ccc(cc1S(=O)(=O)NCCO)-c1c(C)nc2c(NCCNC(C)=O)cc(Cl)nn12
InChI Key InChIKey=MSAKNAXUJISZBR-UHFFFAOYSA-N
Data  1 IC50
PDB links: 1 PDB ID matches this monomer.
  Tab Delimited (TSV)   2D SDfile   Computed 3D by Vconf -m prep SDfile
Find this compound or compounds like it in BindingDB:
Activity Spreadsheet -- Enzyme Inhibition Constant Data from BindingDB
Found 1 hit for monomerid = 50199892
TargetPhosphatidylinositol 4-kinase beta(Homo sapiens (Human))
Academy Of Sciences Of The Czech Republic
Curated by ChEMBL
LigandPNGBDBM50199892(CHEMBL3889874)
Affinity DataIC50:  22nM. Assay description: Inhibition of PI4KB (unknown origin) by ADP-Glo kinase assay