BDBM50200104 CHEMBL3969997
SMILES CCc1cc(CNc2cc(Cl)nn3c(c(C)nc23)-c2ccc(OC)c(c2)S(=O)(=O)N2CCC(CO)CC2)ccn1
InChI Key InChIKey=NKRHGHJWMBLUSF-UHFFFAOYSA-N
Data  1 IC50
  Tab Delimited (TSV)   2D SDfile   Computed 3D by Vconf -m prep SDfile
Find this compound or compounds like it in BindingDB:
Activity Spreadsheet -- Enzyme Inhibition Constant Data from BindingDB
Found 1 hit for monomerid = 50200104
TargetPhosphatidylinositol 4-kinase beta(Homo sapiens (Human))
Academy Of Sciences Of The Czech Republic
Curated by ChEMBL
LigandPNGBDBM50200104(CHEMBL3969997)
Affinity DataIC50:  42nM. Assay description: Inhibition of PI4KB (unknown origin) by ADP-Glo kinase assay
In DepthDetails ArticlePubMed