BDBM50200937 CHEMBL219321::estradiol 3-O-sulfamate
SMILES C[C@]12CC[C@H]3[C@@H](CCc4cc(OS(N)(=O)=O)ccc34)[C@@H]1CC[C@@H]2O
InChI Key InChIKey=YXYXCSOJKUAPJI-ZBRFXRBCSA-N
Data  2 IC50
  Tab Delimited (TSV)   2D SDfile   Computed 3D by Vconf -m prep SDfile
Find this compound or compounds like it in BindingDB:
Activity Spreadsheet -- Enzyme Inhibition Constant Data from BindingDB
Found 2 hits for monomerid = 50200937
TargetSteryl-sulfatase(Homo sapiens (Human))
University Of Bath
Curated by ChEMBL
LigandPNGBDBM50200937(CHEMBL219321 | estradiol 3-O-sulfamate)
Affinity DataIC50:  16nM. Assay description: Inhibition of STS activity in human placental microsome
In DepthDetails ArticlePubMed
TargetSteryl-sulfatase(Homo sapiens (Human))
University Of Bath
Curated by ChEMBL
LigandPNGBDBM50200937(CHEMBL219321 | estradiol 3-O-sulfamate)
Affinity DataIC50:  16nM. Assay description: Inhibition of STS in placental microsomes by radiometric assay
In DepthDetails ArticlePubMed