BDBM50200938 CHEMBL220493::estradiol 17-O-sulfamate
SMILES C[C@]12CC[C@H]3[C@@H](CCc4cc(O)ccc34)[C@@H]1CC[C@@H]2OS(N)(=O)=O
InChI Key InChIKey=NALROBPVVYUESB-ZBRFXRBCSA-N
Data  3 KI  1 IC50
  Tab Delimited (TSV)   2D SDfile   Computed 3D by Vconf -m prep SDfile
Find this compound or compounds like it in BindingDB:
Activity Spreadsheet -- Enzyme Inhibition Constant Data from BindingDB
Found 4 hits for monomerid = 50200938
TargetCarbonic anhydrase 2(Homo sapiens (Human))
University Of Montpellier
Curated by ChEMBL
LigandPNGBDBM50200938(CHEMBL220493 | estradiol 17-O-sulfamate)
Affinity DataKi:  13nM. Assay description: Inhibition of human carbonic anhydrase II
In DepthDetails ArticlePubMed
TargetCarbonic anhydrase 1(Homo sapiens (Human))
University Of Montpellier
Curated by ChEMBL
LigandPNGBDBM50200938(CHEMBL220493 | estradiol 17-O-sulfamate)
Affinity DataKi:  15nM. Assay description: Inhibition of human recombinant carbonic anhydrase I
In DepthDetails ArticlePubMed
TargetCarbonic anhydrase 9(Homo sapiens (Human))
University Of Montpellier
Curated by ChEMBL
LigandPNGBDBM50200938(CHEMBL220493 | estradiol 17-O-sulfamate)
Affinity DataKi:  32nM. Assay description: Inhibitory concentration against catalytic domain of human cloned carbonic anhydrase IX.
In DepthDetails ArticlePubMed
TargetSteryl-sulfatase(Homo sapiens (Human))
University Of Bath
Curated by ChEMBL
LigandPNGBDBM50200938(CHEMBL220493 | estradiol 17-O-sulfamate)
Affinity DataIC50:  5.00E+3nM. Assay description: Inhibition of STS in placental microsomes by radiometric assay
In DepthDetails ArticlePubMed