BDBM50203780 (2S)-2-{[(2S)-1-[(2S)-2-amino-4-methylpentanoyl]pyrrolidin-2-yl]formamido}-N-[(1S)-1-{[(1S)-1-{[(1S)-1-{[(1S)-1-{[(1S)-1-{[(1S)-1-[({[(1S)-1-{[(1S)-4-carbamimidamido-1-{[(1S)-1-carbamoyl-2-phenylethyl]carbamoyl}butyl]carbamoyl}ethyl]carbamoyl}methyl)carbamoyl]-2-phenylethyl]carbamoyl}-2-hydroxyethyl]carbamoyl}-2-carbamoylethyl]carbamoyl}-2-(1H-indol-3-yl)ethyl]carbamoyl}-2-carbamoylethyl]carbamoyl}-2-(4-hydroxyphenyl)ethyl]butanediamide::CHEMBL386958
SMILES CC(C)C[C@H](N)C(=O)N1CCC[C@H]1C(=O)N[C@@H](CC(N)=O)C(=O)N[C@@H](Cc1ccc(O)cc1)C(=O)N[C@@H](CC(N)=O)C(=O)N[C@@H](Cc1c[nH]c2ccccc12)C(=O)N[C@@H](CC(N)=O)C(=O)N[C@@H](CO)C(=O)N[C@@H](Cc1ccccc1)C(=O)NCC(=O)N[C@@H](C)C(=O)N[C@@H](CCCN=C(N)N)C(=O)N[C@@H](Cc1ccccc1)C(N)=O
InChI Key InChIKey=BYXPRMCWXVVZIS-ZZLSJORXSA-N
Data  1 KI  1 EC50
  Tab Delimited (TSV)   2D SDfile   Computed 3D by Vconf -m prep SDfile
Find this compound or compounds like it in BindingDB:
Activity Spreadsheet -- Enzyme Inhibition Constant Data from BindingDB
Found 2 hits for monomerid = 50203780
TargetKiSS-1 receptor(Homo sapiens (Human))
University Of Minnesota Health Science Center
Curated by ChEMBL
LigandPNGBDBM50203780((2S)-2-{[(2S)-1-[(2S)-2-amino-4-methylpentanoyl]py...)
Affinity DataKi:  29.5nM. Assay description: Displacement of [125]metastin from metastin receptor
In DepthDetails ArticlePubMed
TargetKiSS-1 receptor(Homo sapiens (Human))
University Of Minnesota Health Science Center
Curated by ChEMBL
LigandPNGBDBM50203780((2S)-2-{[(2S)-1-[(2S)-2-amino-4-methylpentanoyl]py...)
Affinity DataEC50:  108nM. Assay description: Activity at metastin receptor expressed in HEK293 cells by measuring calcium release
In DepthDetails ArticlePubMed