BDBM50203850 2-methyl-N-{4-[1-(piperidine-1-carbonyl)-piperidin-4-ylsulfamoyl]-naphthalen-1-yl}-benzamide::CHEMBL385108
SMILES Cc1ccccc1C(=O)Nc1ccc(c2ccccc12)S(=O)(=O)NC1CCN(CC1)C(=O)N1CCCCC1
InChI Key InChIKey=XBNXUTMILCXSPR-UHFFFAOYSA-N
Data  1 KI
  Tab Delimited (TSV)   2D SDfile   Computed 3D by Vconf -m prep SDfile
Find this compound or compounds like it in BindingDB:
Activity Spreadsheet -- Enzyme Inhibition Constant Data from BindingDB
Found 1 hit for monomerid = 50203850
TargetC-C chemokine receptor type 8(Homo sapiens (Human))
Millennium Pharmaceuticals
Curated by ChEMBL
LigandPNGBDBM50203850(2-methyl-N-{4-[1-(piperidine-1-carbonyl)-piperidin...)
Affinity DataKi:  4.20nM. Assay description: Binding affinity to human CCR8 expressed in L1.2 cells by FMAT assay
In DepthDetails ArticlePubMed