BDBM50203901 4-(1,3-dioxo-1,3-dihydro-isoindol-2-yl)-naphthalene-1-sulfonic acid (4-methoxy phenyl)-amide::CHEMBL376069
SMILES COc1ccc(NS(=O)(=O)c2ccc(N3C(=O)c4ccccc4C3=O)c3ccccc23)cc1
InChI Key InChIKey=CAJQUHISZZKNRC-UHFFFAOYSA-N
Data  1 KI
  Tab Delimited (TSV)   2D SDfile   Computed 3D by Vconf -m prep SDfile
Find this compound or compounds like it in BindingDB:
Activity Spreadsheet -- Enzyme Inhibition Constant Data from BindingDB
Found 1 hit for monomerid = 50203901
TargetC-C chemokine receptor type 8(Homo sapiens (Human))
Millennium Pharmaceuticals
Curated by ChEMBL
LigandPNGBDBM50203901(4-(1,3-dioxo-1,3-dihydro-isoindol-2-yl)-naphthalen...)
Affinity DataKi: >4.40E+4nM. Assay description: Binding affinity to human CCR8 expressed in L1.2 cells by FMAT assay
In DepthDetails ArticlePubMed