BDBM50204657 CHEMBL3930589
SMILES Oc1ccc(cc1)-c1cn2cc(Cl)ccc2n1
InChI Key InChIKey=MMJUHKRVPBKDDX-UHFFFAOYSA-N
Data  4 IC50
  Tab Delimited (TSV)   2D SDfile   Computed 3D by Vconf -m prep SDfile
Find this compound or compounds like it in BindingDB:
Activity Spreadsheet -- Enzyme Inhibition Constant Data from BindingDB
Found 4 hits for monomerid = 50204657
TargetDual specificity tyrosine-phosphorylation-regulated kinase 1A(Homo sapiens (Human))
Paris-Sud University
Curated by ChEMBL
LigandPNGBDBM50204657(CHEMBL3930589)
Affinity DataIC50: >1.00E+4nM. Assay description: Inhibition of DYRK1A (unknown origin)
In DepthDetails ArticlePubMed
TargetGlycogen synthase kinase-3(Homo sapiens (Human))
Paris-Sud University
Curated by ChEMBL
LigandPNGBDBM50204657(CHEMBL3930589)
Affinity DataIC50: >1.00E+4nM. Assay description: Inhibition of GSK-3 alpha/beta (unknown origin)
In DepthDetails ArticlePubMed
TargetCasein kinase I delta/epsilon(Homo sapiens (Human))
Paris-Sud University
Curated by ChEMBL
LigandPNGBDBM50204657(CHEMBL3930589)
Affinity DataIC50: >1.00E+4nM. Assay description: Inhibition of CK1 delta/epsilon (unknown origin)
In DepthDetails ArticlePubMed
TargetDual specificity protein kinase CLK1(Homo sapiens (Human))
Paris-Sud University
Curated by ChEMBL
LigandPNGBDBM50204657(CHEMBL3930589)
Affinity DataIC50: >1.00E+4nM. Assay description: Inhibition of CLK1 (unknown origin)
In DepthDetails ArticlePubMed