BDBM50205126 (2S)-1-{[(2S,4R)-4-(4-hydroxy-2,6-dimethylphenyl)-2-pyrrolidinyl]carbonyl}-2-pyrrolidinecarbonitrile::CHEMBL243799
SMILES Cc1cc(O)cc(C)c1[C@@H]1CN[C@@H](C1)C(=O)N1CCC[C@H]1C#N
InChI Key InChIKey=SXJNRFKMKXGLJQ-DZKIICNBSA-N
Data  1 IC50
  Tab Delimited (TSV)   2D SDfile   Computed 3D by Vconf -m prep SDfile
Find this compound or compounds like it in BindingDB:
Activity Spreadsheet -- Enzyme Inhibition Constant Data from BindingDB
Found 1 hit for monomerid = 50205126
TargetDipeptidyl peptidase 4(Homo sapiens (Human))
Minase Research Institute
Curated by ChEMBL
LigandPNGBDBM50205126((2S)-1-{[(2S,4R)-4-(4-hydroxy-2,6-dimethylphenyl)-...)
Affinity DataIC50:  3.30nM. Assay description: Inhibition of human DPP4
In DepthDetails ArticlePubMed