BDBM50205137 (2S)-1-{[(2S,4R)-4-cyclohexyl-2-pyrrolidinyl]carbonyl}-2-pyrrolidinecarbonitrile::CHEMBL242492
SMILES O=C([C@@H]1C[C@@H](CN1)C1CCCCC1)N1CCC[C@H]1C#N
InChI Key InChIKey=SLXKNPPPPHIFPX-KKUMJFAQSA-N
Data  1 IC50
  Tab Delimited (TSV)   2D SDfile   Computed 3D by Vconf -m prep SDfile
Find this compound or compounds like it in BindingDB:
Activity Spreadsheet -- Enzyme Inhibition Constant Data from BindingDB
Found 1 hit for monomerid = 50205137
TargetDipeptidyl peptidase 4(Homo sapiens (Human))
Minase Research Institute
Curated by ChEMBL
LigandPNGBDBM50205137((2S)-1-{[(2S,4R)-4-cyclohexyl-2-pyrrolidinyl]carbo...)
Affinity DataIC50:  2.40nM. Assay description: Inhibition of human DPP4
In DepthDetails ArticlePubMed