BDBM50205214 (2S)-1-{[(2S,4R)-4-(2-hydroxyethyl)-2-pyrrolidinyl]carbonyl}-2-pyrrolidinecarbonitrile::CHEMBL395919
SMILES OCC[C@@H]1CN[C@@H](C1)C(=O)N1CCC[C@H]1C#N
InChI Key InChIKey=KIXNBKBVFSPHGP-DCAQKATOSA-N
Data  1 IC50
  Tab Delimited (TSV)   2D SDfile   Computed 3D by Vconf -m prep SDfile
Find this compound or compounds like it in BindingDB:
Activity Spreadsheet -- Enzyme Inhibition Constant Data from BindingDB
Found 1 hit for monomerid = 50205214
TargetDipeptidyl peptidase 4(Homo sapiens (Human))
Minase Research Institute
Curated by ChEMBL
LigandPNGBDBM50205214((2S)-1-{[(2S,4R)-4-(2-hydroxyethyl)-2-pyrrolidinyl...)
Affinity DataIC50:  3.80nM. Assay description: Inhibition of human DPP4
In DepthDetails ArticlePubMed