BDBM50205696 CHEMBL426537::N6-methoxy-2-[(4-methylphenyl)ethynyl]adenosine
SMILES CONc1nc(nc2n(cnc12)[C@@H]1O[C@H](CO)[C@@H](O)[C@H]1O)C#Cc1ccc(C)cc1
InChI Key InChIKey=QEUCNKIJAMGFSL-AEVYOOLXSA-N
Data  3 KI
  Tab Delimited (TSV)   2D SDfile   Computed 3D by Vconf -m prep SDfile
Find this compound or compounds like it in BindingDB:
Activity Spreadsheet -- Enzyme Inhibition Constant Data from BindingDB
Found 3 hits for monomerid = 50205696
TargetAdenosine receptor A3(Homo sapiens (Human))
Universit£
Curated by ChEMBL
LigandPNGBDBM50205696(CHEMBL426537 | N6-methoxy-2-[(4-methylphenyl)ethyn...)
Affinity DataKi:  5.90nM. Assay description: Displacement of [3H]NECA from human recombinant adenosine A3 receptor expressed in CHO cells
In DepthDetails ArticlePubMed
TargetAdenosine receptor A1(Homo sapiens (Human))
Universit£
Curated by ChEMBL
LigandPNGBDBM50205696(CHEMBL426537 | N6-methoxy-2-[(4-methylphenyl)ethyn...)
Affinity DataKi:  1.38E+3nM. Assay description: Displacement of [3H]CCPA from human recombinant adenosine A1 receptor expressed in CHO cells
In DepthDetails ArticlePubMed
TargetAdenosine receptor A2a(Homo sapiens (Human))
Universit£
Curated by ChEMBL
LigandPNGBDBM50205696(CHEMBL426537 | N6-methoxy-2-[(4-methylphenyl)ethyn...)
Affinity DataKi:  3.51E+4nM. Assay description: Displacement of [3H]NECA from human recombinant adenosine A2A receptor expressed in CHO cells
In DepthDetails ArticlePubMed