BDBM50207422 CHEMBL3966260
SMILES COc1c(C)cnc(Cn2cc(Cc3cccc(c3)C(F)(F)F)c3c(Cl)nc(N)nc23)c1C
InChI Key InChIKey=LJCPUCNMPPBSIU-UHFFFAOYSA-N
Data  1 IC50
  Tab Delimited (TSV)   2D SDfile   Computed 3D by Vconf -m prep SDfile
Find this compound or compounds like it in BindingDB:
Activity Spreadsheet -- Enzyme Inhibition Constant Data from BindingDB
Found 1 hit for monomerid = 50207422
TargetHeat shock protein HSP 90-alpha(Homo sapiens (Human))
Korea University
Curated by ChEMBL
LigandPNGBDBM50207422(CHEMBL3966260)
Affinity DataIC50:  8.70E+3nM. Assay description: Inhibition of FITC-labeled geldanamycin binding to human Hsp90alpha by fluorescence polarization assay
In DepthDetails ArticlePubMed