BDBM50209100 4-hydroxymethylbenzoate::CHEMBL325372::Methyl paraben::Methylparaben::cid_7456::methyl 4-hydroxybenzoate
SMILES COC(=O)c1ccc(O)cc1
InChI Key InChIKey=LXCFILQKKLGQFO-UHFFFAOYSA-N
Data  6 KI  2 IC50  1 EC50
PDB links: 4 PDB IDs match this monomer.
  Tab Delimited (TSV)   2D SDfile   Computed 3D by Vconf -m prep SDfile
Find this compound or compounds like it in BindingDB:
Activity Spreadsheet -- Enzyme Inhibition Constant Data from BindingDB
Found 9 hits for monomerid = 50209100
TargetCarbonic anhydrase 7(Homo sapiens (Human))
Universit£
Curated by ChEMBL
LigandPNGBDBM50209100(4-hydroxymethylbenzoate | CHEMBL325372 | Methyl pa...)
Affinity DataKi:  780nM. Assay description: Inhibition of human carbonic anhydrase 7 preincubated for 15 mins by CO2 hydration stopped-flow assay
In DepthDetails ArticlePubMed
TargetCarbonic anhydrase 12(Homo sapiens (Human))
Universit£
Curated by ChEMBL
LigandPNGBDBM50209100(4-hydroxymethylbenzoate | CHEMBL325372 | Methyl pa...)
Affinity DataKi:  820nM. Assay description: Inhibition of human carbonic anhydrase 12 preincubated for 15 mins by CO2 hydration stopped-flow assay
In DepthDetails ArticlePubMed
TargetCarbonic anhydrase 1(Homo sapiens (Human))
Universit£
Curated by ChEMBL
LigandPNGBDBM50209100(4-hydroxymethylbenzoate | CHEMBL325372 | Methyl pa...)
Affinity DataKi:  2.60E+3nM. Assay description: Inhibition of human carbonic anhydrase 1 preincubated for 15 mins by CO2 hydration stopped-flow assay
In DepthDetails ArticlePubMed
TargetCarbonic anhydrase 2(Homo sapiens (Human))
Universit£
Curated by ChEMBL
LigandPNGBDBM50209100(4-hydroxymethylbenzoate | CHEMBL325372 | Methyl pa...)
Affinity DataKi:  3.40E+3nM. Assay description: Inhibition of human carbonic anhydrase 2 preincubated for 15 mins by CO2 hydration stopped-flow assay
In DepthDetails ArticlePubMed
TargetCarbonic anhydrase 14(Homo sapiens (Human))
Universit£
Curated by ChEMBL
LigandPNGBDBM50209100(4-hydroxymethylbenzoate | CHEMBL325372 | Methyl pa...)
Affinity DataKi:  4.10E+3nM. Assay description: Inhibition of human carbonic anhydrase 14 preincubated for 15 mins by CO2 hydration stopped-flow assay
In DepthDetails ArticlePubMed
TargetCarbonic anhydrase 9(Homo sapiens (Human))
Universit£
Curated by ChEMBL
LigandPNGBDBM50209100(4-hydroxymethylbenzoate | CHEMBL325372 | Methyl pa...)
Affinity DataKi:  5.50E+3nM. Assay description: Inhibition of human carbonic anhydrase 9 preincubated for 15 mins by CO2 hydration stopped-flow assay
In DepthDetails ArticlePubMed
TargetAndrogen receptor(Rattus norvegicus (Rat))
University Of Basel
Curated by ChEMBL
LigandPNGBDBM50209100(4-hydroxymethylbenzoate | CHEMBL325372 | Methyl pa...)
Affinity DataIC50: >4.27E+5nM. Assay description: Inhibitory concentration against recombinant rat androgen receptor expressed in Escherichia coli using [3H]methyltrienolone (R 1881)
In DepthDetails ArticlePubMed
TargetGlycogen synthase kinase-3 beta(Homo sapiens (Human))
Broad Institute
Curated by PubChem BioAssay
LigandPNGBDBM50209100(4-hydroxymethylbenzoate | CHEMBL325372 | Methyl pa...)
Affinity DataEC50: >3.00E+5nM. Assay description: Keywords: GSK3beta, dose response, kinase, inhibition, HTS Assay Overview: The glycogen synthase kinase-3 beta (GSK-3b) is a known master regulator f...
In DepthDetails PCBioAssay
TargetXanthine dehydrogenase/oxidase(Homo sapiens (Human))
Università
Curated by ChEMBL
LigandPNGBDBM50209100(4-hydroxymethylbenzoate | CHEMBL325372 | Methyl pa...)
Affinity DataIC50: >5.00E+4nM. Assay description: Inhibition of xanthine oxidase (unknown origin)-mediated formation of uric acid by spectrophotometry
In DepthDetails ArticlePubMed