BDBM50211651 3-(4-(4-((1-(2-chlorophenyl)ethoxy)carbonyl)isoxazol-5-yl)benzylthio)propanoic acid::CHEMBL246928
SMILES CC(OC(=O)Nc1cnoc1-c1ccc(CSCCC(O)=O)cc1)c1ccccc1Cl
InChI Key InChIKey=BZXVIJFDXYBSIG-UHFFFAOYSA-N
Data  2 IC50
  Tab Delimited (TSV)   2D SDfile   Computed 3D by Vconf -m prep SDfile
Find this compound or compounds like it in BindingDB:
Activity Spreadsheet -- Enzyme Inhibition Constant Data from BindingDB
Found 2 hits for monomerid = 50211651
TargetLysophosphatidic acid receptor 1(Homo sapiens (Human))
Ajinomoto
Curated by ChEMBL
LigandPNGBDBM50211651(3-(4-(4-((1-(2-chlorophenyl)ethoxy)carbonyl)isoxaz...)
Affinity DataIC50:  260nM. Assay description: Antagonist activity at human recombinant LPA1 receptor expressed in CHOK1 cells assessed as inhibition of lysophosphatidic acid-induced intracellular...
In DepthDetails ArticlePubMed
TargetLysophosphatidic acid receptor 1(Rattus norvegicus)
Ajinomoto
Curated by ChEMBL
LigandPNGBDBM50211651(3-(4-(4-((1-(2-chlorophenyl)ethoxy)carbonyl)isoxaz...)
Affinity DataIC50:  81nM. Assay description: Antagonist activity at LPA1 receptor in rat hepatic stellate cells assessed as inhibition of lysophosphatidic acid-induced intracellular calcium infl...
In DepthDetails ArticlePubMed