BDBM50212548 1-(3-methylbenzo[b]thiophen-2-yl)-2-(phenylsulfonyl)ethanone::CHEMBL240075
SMILES Cc1c(sc2ccccc12)C(=O)CS(=O)(=O)c1ccccc1
InChI Key InChIKey=OFJXJEVECAIRCB-UHFFFAOYSA-N
Data  1 IC50
  Tab Delimited (TSV)   2D SDfile   Computed 3D by Vconf -m prep SDfile
Find this compound or compounds like it in BindingDB:
Activity Spreadsheet -- Enzyme Inhibition Constant Data from BindingDB
Found 1 hit for monomerid = 50212548
Target11-beta-hydroxysteroid dehydrogenase 1(Homo sapiens (Human))
Wyeth Research
Curated by ChEMBL
LigandPNGBDBM50212548(1-(3-methylbenzo[b]thiophen-2-yl)-2-(phenylsulfony...)
Affinity DataIC50:  525nM. Assay description: Inhibition of human 11beta-HSD1 expressed in CHO cells
In DepthDetails ArticlePubMed