BDBM50212549 1-(4-fluorophenyl)-3-(phenylsulfonyl)propan-1-one::CHEMBL397827
SMILES Fc1ccc(cc1)C(=O)CCS(=O)(=O)c1ccccc1
InChI Key InChIKey=DMAMKPWVVZCTDR-UHFFFAOYSA-N
Data  1 IC50
  Tab Delimited (TSV)   2D SDfile   Computed 3D by Vconf -m prep SDfile
Find this compound or compounds like it in BindingDB:
Activity Spreadsheet -- Enzyme Inhibition Constant Data from BindingDB
Found 1 hit for monomerid = 50212549
Target11-beta-hydroxysteroid dehydrogenase 1(Homo sapiens (Human))
Wyeth Research
Curated by ChEMBL
LigandPNGBDBM50212549(1-(4-fluorophenyl)-3-(phenylsulfonyl)propan-1-one ...)
Affinity DataIC50:  1.96E+4nM. Assay description: Inhibition of human 11beta-HSD1 expressed in CHO cells
In DepthDetails ArticlePubMed