BDBM50213396 CHEMBL232345::methyl 3-((2-(1-benzoyl-4-phenylpiperidin-4-yl)-1H-imidazol-1-yl)methyl)benzoate
SMILES COC(=O)c1cccc(Cn2ccnc2C2(CCN(CC2)C(=O)c2ccccc2)c2ccccc2)c1
InChI Key InChIKey=DCXNTSYCYUPHPH-UHFFFAOYSA-N
Data  2 KI
  Tab Delimited (TSV)   2D SDfile   Computed 3D by Vconf -m prep SDfile
Find this compound or compounds like it in BindingDB:
Activity Spreadsheet -- Enzyme Inhibition Constant Data from BindingDB
Found 2 hits for monomerid = 50213396
TargetDelta-type opioid receptor(Homo sapiens (Human))
Johnson & Johnson Pharmaceutical Research & Development
Curated by ChEMBL
LigandPNGBDBM50213396(CHEMBL232345 | methyl 3-((2-(1-benzoyl-4-phenylpip...)
Affinity DataKi:  85nM. Assay description: Displacement of [3H]DPDPE from cloned human delta opioid receptor
In DepthDetails ArticlePubMed
TargetMu-type opioid receptor(Homo sapiens (Human))
Johnson & Johnson Pharmaceutical Research & Development
Curated by ChEMBL
LigandPNGBDBM50213396(CHEMBL232345 | methyl 3-((2-(1-benzoyl-4-phenylpip...)
Affinity DataKi: >465nM. Assay description: Displacement of [3H]DAMGO from cloned human mu opioid receptor
In DepthDetails ArticlePubMed