BDBM50214151 CHEMBL414538
SMILES CSCC[C@H](NC(=O)CNC(=O)[C@@H](NC(=O)[C@H](Cc1ccccc1)NC(=O)[C@H](CC(N)=O)NC(=O)[C@H](CC(C)C)NC(=O)[C@H](CC(O)=O)NC(=O)[C@H](CC(O)=O)NC(=O)[C@H](Cc1ccccc1)NC(C)=O)[C@@H](C)O)C(=O)N1CCC[C@H]1C(=O)N1CCC[C@H]1C(=O)N[C@@H](C)C(=O)N[C@@H](CC(O)=O)C(=O)N[C@@H](CCC(O)=O)C(=O)N[C@@H](CC(O)=O)C(=O)N[C@@H](Cc1ccc(O)cc1)C(=O)N[C@@H](CO)C(=O)N1CCC[C@H]1C(N)=O
InChI Key InChIKey=FZTDVRJRYDBJHC-KZXGHMFYSA-N
Data  1 KI
  Tab Delimited (TSV)   2D SDfile   Computed 3D by Vconf -m prep SDfile
Find this compound or compounds like it in BindingDB:
Activity Spreadsheet -- Enzyme Inhibition Constant Data from BindingDB
Found 1 hit for monomerid = 50214151
TargetC-X-C chemokine receptor type 1/2(Homo sapiens (Human))TBA
LigandPNGBDBM50214151(CHEMBL414538)
Affinity DataKi:  1.20E+5nM. Assay description: Inhibitory activity against interleukin-8 receptor using [125I]IL8
In DepthDetails