BDBM50215531 2-chloro-alpha-[[(4-chlorophenyl)amino]methylene]-N-isopropyl-beta-oxobenzenepropanamide::CHEMBL229534
SMILES CC(C)NC(=O)C(C=Nc1ccc(Cl)cc1)C(=O)c1ccccc1Cl
InChI Key InChIKey=VAFBVUDMJKXULX-UHFFFAOYSA-N
Data  1 IC50  1 EC50
  Tab Delimited (TSV)   2D SDfile   Computed 3D by Vconf -m prep SDfile
Find this compound or compounds like it in BindingDB:
Activity Spreadsheet -- Enzyme Inhibition Constant Data from BindingDB
Found 2 hits for monomerid = 50215531
TargetGamma-aminobutyric acid receptor subunit alpha-1/beta-2/gamma-2(Rattus norvegicus (Rat))
Wuhan Institute Of Technology
Curated by ChEMBL
LigandPNGBDBM50215531(2-chloro-alpha-[[(4-chlorophenyl)amino]methylene]-...)
Affinity DataIC50:  40nM. Assay description: Inhibition of rat GABA alpha-1-beta-2-gamma-2 receptor
In DepthDetails ArticlePubMed
TargetGamma-aminobutyric acid receptor subunit alpha-1/beta-2/gamma-2(Homo sapiens (Human))
University Of California Irvine
Curated by ChEMBL
LigandPNGBDBM50215531(2-chloro-alpha-[[(4-chlorophenyl)amino]methylene]-...)
Affinity DataEC50:  34nM. Assay description: Activity at human GABAA alpha-1-beta-2-gamma-2L expressed in Xenopus oocytes assessed as potentiation of GABA currents
In DepthDetails ArticlePubMed