BDBM50216779 CHEMBL58200
SMILES FC(F)(F)c1cc(Cl)c(C(=O)OCn2ccc(=O)[nH]c2=O)c(Cl)c1
InChI Key InChIKey=ZEHZDWNKWHOWSI-UHFFFAOYSA-N
Data  1 IC50
  Tab Delimited (TSV)   2D SDfile   Computed 3D by Vconf -m prep SDfile
Find this compound or compounds like it in BindingDB:
Activity Spreadsheet -- Enzyme Inhibition Constant Data from BindingDB
Found 1 hit for monomerid = 50216779
TargetAcetolactate synthase, chloroplastic(Arabidopsis thaliana)
Nankai University
Curated by ChEMBL
LigandPNGBDBM50216779(CHEMBL58200)
Affinity DataIC50: >2.61E+5nM. Assay description: Inhibitory activity against Acetolactate synthase (ALS) enzyme by using the rape-root growth method
In DepthDetails ArticlePubMed