BDBM50217228 CHEMBL98195
SMILES CC(=O)c1ccc2OC(C)(C)[C@H](O)[C@@H](NC(=O)c3ccsc3)c2c1
InChI Key InChIKey=WRTOKPSXGVEQHE-JKSUJKDBSA-N
Data  1 KI
  Tab Delimited (TSV)   2D SDfile   Computed 3D by Vconf -m prep SDfile
Find this compound or compounds like it in BindingDB:
Activity Spreadsheet -- Enzyme Inhibition Constant Data from BindingDB
Found 1 hit for monomerid = 50217228
Target5-hydroxytryptamine receptor 1D(RAT)
Smithkline Beecham Pharmaceuticals
Curated by ChEMBL
LigandPNGBDBM50217228(CHEMBL98195)
Affinity DataKi:  158nM. Assay description: Binding affinity to 5-hydroxytryptamine 1D receptor in the rat forebrain by [3H]- SB-204269 displacement.
In DepthDetails ArticlePubMed