BDBM50217434 2S,4R,20S-4-{[2-carboxy-2-(2,4,6-trimethyl-benzoylamino)-ethylcarbamoyl]-methoxy}-2-(pyridin-2-ylaminomethyl)-pyrrolidine-1-carboxylic acid benzyl ester::CHEMBL396743
SMILES Cc1cc(C)c(C(=O)N[C@@H](CNC(=O)CO[C@@H]2C[C@@H](CNc3ccccn3)N(C2)C(=O)OCc2ccccc2)C(O)=O)c(C)c1
InChI Key InChIKey=ZJQXQBNPHQGXKR-VJGNERBWSA-N
Data  7 IC50
  Tab Delimited (TSV)   2D SDfile   Computed 3D by Vconf -m prep SDfile
Find this compound or compounds like it in BindingDB:
Activity Spreadsheet -- Enzyme Inhibition Constant Data from BindingDB
Found 7 hits for monomerid = 50217434
TargetIntegrin alpha-IIb/beta-3(Homo sapiens (Human))
Jerini
Curated by ChEMBL
LigandPNGBDBM50217434(2S,4R,20S-4-{[2-carboxy-2-(2,4,6-trimethyl-benzoyl...)
Affinity DataIC50: >5.00E+4nM. Assay description: Inhibition of integrin alpha2bbeta3 receptor by ELISA
In DepthDetails ArticlePubMed
TargetIntegrin alpha-V/beta-5(Homo sapiens (Human))
Jerini
Curated by ChEMBL
LigandPNGBDBM50217434(2S,4R,20S-4-{[2-carboxy-2-(2,4,6-trimethyl-benzoyl...)
Affinity DataIC50:  3.00E+4nM. Assay description: Inhibition of integrin alphaVbeta5 receptor by ELISA
In DepthDetails ArticlePubMed
TargetIntegrin alpha-5/beta-1(Homo sapiens (Human))
Jerini
Curated by ChEMBL
LigandPNGBDBM50217434(2S,4R,20S-4-{[2-carboxy-2-(2,4,6-trimethyl-benzoyl...)
Affinity DataIC50:  3.5nM. Assay description: Inhibition of integrin alpha5beta1 receptor by ELISA
In DepthDetails ArticlePubMed
TargetIntegrin alpha-5/beta-1(Homo sapiens (Human))
Jerini
Curated by ChEMBL
LigandPNGBDBM50217434(2S,4R,20S-4-{[2-carboxy-2-(2,4,6-trimethyl-benzoyl...)
Affinity DataIC50:  586nM. Assay description: Antagonist activity at integrin alpha5beta1 in human K562 cells assessed as inhibition of cell adhesion
In DepthDetails ArticlePubMed
TargetIntegrin alpha-V/beta-3(Homo sapiens (Human))
Astrazeneca
Curated by ChEMBL
LigandPNGBDBM50217434(2S,4R,20S-4-{[2-carboxy-2-(2,4,6-trimethyl-benzoyl...)
Affinity DataIC50:  1.20E+3nM. Assay description: Antagonist activity at integrin alphavbeta3 in human A375M cells assessed as inhibition of cell adhesion to fibrinogen in presence of Mg2+
In DepthDetails ArticlePubMed
TargetIntegrin alpha-5/beta-1(Homo sapiens (Human))
Jerini
Curated by ChEMBL
LigandPNGBDBM50217434(2S,4R,20S-4-{[2-carboxy-2-(2,4,6-trimethyl-benzoyl...)
Affinity DataIC50:  200nM. Assay description: Antagonist activity at integrin alpha5beta1 in human A375M cells assessed as inhibition of cell adhesion to fibronectin in presence of Mg2+ and MK-04...
In DepthDetails ArticlePubMed
TargetIntegrin alpha-V/beta-3(Homo sapiens (Human))
Astrazeneca
Curated by ChEMBL
LigandPNGBDBM50217434(2S,4R,20S-4-{[2-carboxy-2-(2,4,6-trimethyl-benzoyl...)
Affinity DataIC50:  3.00E+4nM. Assay description: Inhibition of integrin alphaVbeta3 receptor by ELISA
In DepthDetails ArticlePubMed