BDBM50219110 CHEMBL244990::N-(4-(4-(2,3-dichlorophenyl)piperazin-1-yl)-3-hydroxybutyl)-4-pyridin-2-ylbenzamide
SMILES OC(CCNC(=O)c1ccc(cc1)-c1ccccn1)CN1CCN(CC1)c1cccc(Cl)c1Cl
InChI Key InChIKey=JTJUCUMXKUPFBQ-UHFFFAOYSA-N
Data  6 KI  2 EC50
  Tab Delimited (TSV)   2D SDfile   Computed 3D by Vconf -m prep SDfile
Find this compound or compounds like it in BindingDB:
Activity Spreadsheet -- Enzyme Inhibition Constant Data from BindingDB
Found 8 hits for monomerid = 50219110
TargetD(3) dopamine receptor(Homo sapiens (Human))
National Institute On Drug Abuse-Intramural Research Program
Curated by ChEMBL
LigandPNGBDBM50219110(CHEMBL244990 | N-(4-(4-(2,3-dichlorophenyl)piperaz...)
Affinity DataKi:  3nM. Assay description: Displacement of [125I]IABN from human dopamine D3 receptor expressed in HEK293 cells
In DepthDetails ArticlePubMed
Target5-hydroxytryptamine receptor 1A(Homo sapiens (Human))
National Institute On Drug Abuse-Intramural Research Program
Curated by ChEMBL
LigandPNGBDBM50219110(CHEMBL244990 | N-(4-(4-(2,3-dichlorophenyl)piperaz...)
Affinity DataKi:  34.3nM. Assay description: Binding affinity to human 5HT1A receptor
In DepthDetails ArticlePubMed
Target5-hydroxytryptamine receptor 2A(Homo sapiens (Human))
National Institute On Drug Abuse-Intramural Research Program
Curated by ChEMBL
LigandPNGBDBM50219110(CHEMBL244990 | N-(4-(4-(2,3-dichlorophenyl)piperaz...)
Affinity DataKi:  42.3nM. Assay description: Binding affinity to human 5HT2A receptor
In DepthDetails ArticlePubMed
Target5-hydroxytryptamine receptor 2C(Homo sapiens (Human))
National Institute On Drug Abuse-Intramural Research Program
Curated by ChEMBL
LigandPNGBDBM50219110(CHEMBL244990 | N-(4-(4-(2,3-dichlorophenyl)piperaz...)
Affinity DataKi:  115nM. Assay description: Binding affinity to human 5HT2C receptor
In DepthDetails ArticlePubMed
TargetD(2) dopamine receptor(Homo sapiens (Human))
National Institute On Drug Abuse-Intramural Research Program
Curated by ChEMBL
LigandPNGBDBM50219110(CHEMBL244990 | N-(4-(4-(2,3-dichlorophenyl)piperaz...)
Affinity DataKi:  267nM. Assay description: Displacement of [125I]IABN from human dopamine D2 receptor expressed in HEK293 cells
In DepthDetails ArticlePubMed
TargetD(4) dopamine receptor(Homo sapiens (Human))
National Institute On Drug Abuse-Intramural Research Program
Curated by ChEMBL
LigandPNGBDBM50219110(CHEMBL244990 | N-(4-(4-(2,3-dichlorophenyl)piperaz...)
Affinity DataKi:  4.62E+3nM. Assay description: Displacement of [125I]IABN from human dopamine D4 receptor expressed in HEK293 cells
In DepthDetails ArticlePubMed
TargetD(2) dopamine receptor(Homo sapiens (Human))
National Institute On Drug Abuse-Intramural Research Program
Curated by ChEMBL
LigandPNGBDBM50219110(CHEMBL244990 | N-(4-(4-(2,3-dichlorophenyl)piperaz...)
Affinity DataEC50:  15.8nM. Assay description: Agonist activity at human dopamine D2 receptor expressed in HEK293 cells by mitogenesis assay
In DepthDetails ArticlePubMed
TargetD(3) dopamine receptor(Homo sapiens (Human))
National Institute On Drug Abuse-Intramural Research Program
Curated by ChEMBL
LigandPNGBDBM50219110(CHEMBL244990 | N-(4-(4-(2,3-dichlorophenyl)piperaz...)
Affinity DataEC50:  1nM. Assay description: Agonist activity at human dopamine D3 receptor expressed in HEK293 cells by mitogenesis assay
In DepthDetails ArticlePubMed