BDBM50219231 4-[4-(benzyloxy)piperidino]butyl-3-fluorobenzoate::CHEMBL228359
SMILES Fc1cccc(c1)C(=O)OCCCCN1CCC(CC1)OCc1ccccc1
InChI Key InChIKey=YJPYLKLJKPTNBQ-UHFFFAOYSA-N
Data  2 IC50
  Tab Delimited (TSV)   2D SDfile   Computed 3D by Vconf -m prep SDfile
Find this compound or compounds like it in BindingDB:
Activity Spreadsheet -- Enzyme Inhibition Constant Data from BindingDB
Found 2 hits for monomerid = 50219231
TargetCholinesterase(Homo sapiens (Human))
Woosuk University
Curated by ChEMBL
LigandPNGBDBM50219231(4-[4-(benzyloxy)piperidino]butyl-3-fluorobenzoate ...)
Affinity DataIC50:  1.58E+3nM. Assay description: Inhibition of human BChE by Ellman's method
In DepthDetails ArticlePubMed
TargetAcetylcholinesterase(Electrophorus electricus (Electric eel))
Woosuk University
Curated by ChEMBL
LigandPNGBDBM50219231(4-[4-(benzyloxy)piperidino]butyl-3-fluorobenzoate ...)
Affinity DataIC50: >1.00E+5nM. Assay description: Inhibition of Electrophorus electricus AChE by Ellman's method
In DepthDetails ArticlePubMed