BDBM50219235 4-[4-(benzyloxy)piperidino]butyl-N-(4-fluorophenyl)carbamate::CHEMBL228361
SMILES Fc1ccc(NC(=O)OCCCCN2CCC(CC2)OCc2ccccc2)cc1
InChI Key InChIKey=MVZFGRRKRJNJDO-UHFFFAOYSA-N
Data  2 IC50
  Tab Delimited (TSV)   2D SDfile   Computed 3D by Vconf -m prep SDfile
Find this compound or compounds like it in BindingDB:
Activity Spreadsheet -- Enzyme Inhibition Constant Data from BindingDB
Found 2 hits for monomerid = 50219235
TargetCholinesterase(Homo sapiens (Human))
Woosuk University
Curated by ChEMBL
LigandPNGBDBM50219235(4-[4-(benzyloxy)piperidino]butyl-N-(4-fluorophenyl...)
Affinity DataIC50:  780nM. Assay description: Inhibition of human BChE by Ellman's method
In DepthDetails ArticlePubMed
TargetAcetylcholinesterase(Electrophorus electricus (Electric eel))
Woosuk University
Curated by ChEMBL
LigandPNGBDBM50219235(4-[4-(benzyloxy)piperidino]butyl-N-(4-fluorophenyl...)
Affinity DataIC50: >1.00E+5nM. Assay description: Inhibition of Electrophorus electricus AChE by Ellman's method
In DepthDetails ArticlePubMed