BDBM50219239 4-[4-(benzhydryloxy)piperidino]butyl 4-isopropylbenzoate::CHEMBL229051
SMILES CC(C)c1ccc(cc1)C(=O)OCCCCN1CCC(CC1)OC(c1ccccc1)c1ccccc1
InChI Key InChIKey=QUOAJLYKYXSDOC-UHFFFAOYSA-N
Data  2 IC50
  Tab Delimited (TSV)   2D SDfile   Computed 3D by Vconf -m prep SDfile
Find this compound or compounds like it in BindingDB:
Activity Spreadsheet -- Enzyme Inhibition Constant Data from BindingDB
Found 2 hits for monomerid = 50219239
TargetAcetylcholinesterase(Electrophorus electricus (Electric eel))
Woosuk University
Curated by ChEMBL
LigandPNGBDBM50219239(4-[4-(benzhydryloxy)piperidino]butyl 4-isopropylbe...)
Affinity DataIC50:  3.89E+3nM. Assay description: Inhibition of Electrophorus electricus AChE by Ellman's method
In DepthDetails ArticlePubMed
TargetCholinesterase(Homo sapiens (Human))
Woosuk University
Curated by ChEMBL
LigandPNGBDBM50219239(4-[4-(benzhydryloxy)piperidino]butyl 4-isopropylbe...)
Affinity DataIC50:  2.32E+4nM. Assay description: Inhibition of human BChE by Ellman's method
In DepthDetails ArticlePubMed