BDBM50219777 CHEMBL281988
SMILES FC(F)(F)c1ccc(=O)n(c1)[C@@H]1CCCN(Cc2cc3cc(ccc3o2)C(=O)N2CCC(CC2)N2C(=O)OCc3ccccc23)C1
InChI Key InChIKey=BGUKJIRWJBBKFX-HHHXNRCGSA-N
Data  1 KI
  Tab Delimited (TSV)   2D SDfile   Computed 3D by Vconf -m prep SDfile
Find this compound or compounds like it in BindingDB:
Activity Spreadsheet -- Enzyme Inhibition Constant Data from BindingDB
Found 1 hit for monomerid = 50219777
TargetOxytocin receptor(Homo sapiens (Human))
Glaxosmithkline
Curated by ChEMBL
LigandPNGBDBM50219777(CHEMBL281988)
Affinity DataKi:  25nM. Assay description: Displacement of 3[H]oxytocin from human oxytocin receptor
In DepthDetails ArticlePubMed