BDBM50220747 CHEMBL56863
SMILES FC(F)(F)COc1ccccc1N1CCN(CCCn2c(=O)[nH]c3ccccc3c2=O)CC1
InChI Key InChIKey=LOSOVXONSYGDJN-UHFFFAOYSA-N
Data  3 KI
  Tab Delimited (TSV)   2D SDfile   Computed 3D by Vconf -m prep SDfile
Find this compound or compounds like it in BindingDB:
Activity Spreadsheet -- Enzyme Inhibition Constant Data from BindingDB
Found 3 hits for monomerid = 50220747
TargetAlpha-1A adrenergic receptor(Homo sapiens (Human))
Roche Bioscience
Curated by ChEMBL
LigandPNGBDBM50220747(CHEMBL56863)
Affinity DataKi:  0.0631nM. Assay description: Inhibition of [3H]prazosin binding to CHO-K1 whole cells expressing human cloned Alpha-1A adrenergic receptor
In DepthDetails ArticlePubMed
TargetAlpha-1D adrenergic receptor(Homo sapiens (Human))
Roche Bioscience
Curated by ChEMBL
LigandPNGBDBM50220747(CHEMBL56863)
Affinity DataKi:  2nM. Assay description: Inhibition of [3H]prazosin binding to CHO-K1 whole cells expressing human cloned Alpha-1D adrenergic receptor
In DepthDetails ArticlePubMed
TargetAlpha-1B adrenergic receptor(Homo sapiens (Human))
Roche Bioscience
Curated by ChEMBL
LigandPNGBDBM50220747(CHEMBL56863)
Affinity DataKi:  5nM. Assay description: Inhibition of [3H]prazosin binding to CHO-K1 whole cells expressing human cloned Alpha-1B adrenergic receptor
In DepthDetails ArticlePubMed