BDBM50221846 2-alpha-acetoxy-1-alpha-benzoyloxy-6-beta,9-beta-difuroyloxy-4-beta-hydroxy-dihydro-beta-agarofuran::CHEMBL397408
SMILES CC(=O)O[C@H]1C[C@@](C)(O)[C@]23OC(C)(C)[C@H](C[C@H](OC(=O)c4ccco4)[C@]2(C)[C@H]1OC(=O)c1ccccc1)[C@H]3OC(=O)c1ccco1
InChI Key InChIKey=XECYEQPZNKDZBP-QINZXMGZSA-N
Data  1 KI
  Tab Delimited (TSV)   2D SDfile   Computed 3D by Vconf -m prep SDfile
Find this compound or compounds like it in BindingDB:
Activity Spreadsheet -- Enzyme Inhibition Constant Data from BindingDB
Found 1 hit for monomerid = 50221846
TargetATP-dependent translocase ABCB1(Homo sapiens (Human))
Instituto Universitario De Bio-Organica Antonio Gonzalez
Curated by ChEMBL
LigandPNGBDBM50221846(2-alpha-acetoxy-1-alpha-benzoyloxy-6-beta,9-beta-d...)
Affinity DataKi:  3.45E+3nM. Assay description: Inhibition of human Pgp-mediated DNR transport in NIH3T3 cells by microplate assay
In DepthDetails ArticlePubMed