BDBM50223985 8-methyl-8-aza-bicyclo[3.2.1]octan-3-yl (3-methylthiophen-2-yl)methyl(phenyl)carbamate::CHEMBL391845
SMILES CN1C2CCC1CC(C2)OC(=O)N(Cc1sccc1C)c1ccccc1
InChI Key InChIKey=REFOKOYWCWAHCW-UHFFFAOYSA-N
Data  3 IC50
  Tab Delimited (TSV)   2D SDfile   Computed 3D by Vconf -m prep SDfile
Find this compound or compounds like it in BindingDB:
Activity Spreadsheet -- Enzyme Inhibition Constant Data from BindingDB
Found 3 hits for monomerid = 50223985
TargetMuscarinic acetylcholine receptor M1(Homo sapiens (Human))
Glaxosmithkline
Curated by ChEMBL
LigandPNGBDBM50223985(8-methyl-8-aza-bicyclo[3.2.1]octan-3-yl (3-methylt...)
Affinity DataIC50:  117nM. Assay description: Antagonist activity at cloned muscarinic M1 receptor expressed in CHO cells by measuring calcium mobilization
In DepthDetails ArticlePubMed
TargetMuscarinic acetylcholine receptor M3(Homo sapiens (Human))
Glaxosmithkline
Curated by ChEMBL
LigandPNGBDBM50223985(8-methyl-8-aza-bicyclo[3.2.1]octan-3-yl (3-methylt...)
Affinity DataIC50:  108nM. Assay description: Antagonist activity at cloned muscarinic M3 receptor expressed in CHO cells by measuring calcium mobilization
In DepthDetails ArticlePubMed
TargetMuscarinic acetylcholine receptor M2(Homo sapiens (Human))
Glaxosmithkline
Curated by ChEMBL
LigandPNGBDBM50223985(8-methyl-8-aza-bicyclo[3.2.1]octan-3-yl (3-methylt...)
Affinity DataIC50:  191nM. Assay description: Antagonist activity at cloned muscarinic M2 receptor expressed in CHO cells by measuring calcium mobilization
In DepthDetails ArticlePubMed