BDBM50224369 1-(2-chloro-2-phenylethyl)-6-(ethylthio)-N-phenethyl-1H-pyrazolo[3,4-d]pyrimidin-4-amine::CHEMBL392301
SMILES CCSc1nc(NCCc2ccccc2)c2cnn(CC(Cl)c3ccccc3)c2n1
InChI Key InChIKey=GWPZAFFIOBYFPC-UHFFFAOYSA-N
Data  3 KI
  Tab Delimited (TSV)   2D SDfile   Computed 3D by Vconf -m prep SDfile
Find this compound or compounds like it in BindingDB:
Activity Spreadsheet -- Enzyme Inhibition Constant Data from BindingDB
Found 3 hits for monomerid = 50224369
TargetTyrosine-protein kinase ABL1(Homo sapiens (Human))
Universit£
Curated by ChEMBL
LigandPNGBDBM50224369(1-(2-chloro-2-phenylethyl)-6-(ethylthio)-N-pheneth...)
Affinity DataKi:  130nM. Assay description: Inhibition of human recombinant Abl
In DepthDetails ArticlePubMed
TargetProto-oncogene tyrosine-protein kinase Src(Homo sapiens (Human))
Università
Curated by ChEMBL
LigandPNGBDBM50224369(1-(2-chloro-2-phenylethyl)-6-(ethylthio)-N-pheneth...)
Affinity DataKi:  7.50E+3nM. Assay description: Inhibition of human recombinant Src
In DepthDetails ArticlePubMed
TargetProto-oncogene tyrosine-protein kinase Src(Homo sapiens (Human))
Università
Curated by ChEMBL
LigandPNGBDBM50224369(1-(2-chloro-2-phenylethyl)-6-(ethylthio)-N-pheneth...)
Affinity DataKi:  7.50E+3nM. Assay description: Inhibition of human recombinant Src
In DepthDetails ArticlePubMed