BDBM50224501 (E)-2-(4-(7-methoxy-1H-indol-3-yl)piperidin-1-yl)-2-(1-(3-(3,4,5-trifluorophenyl)acryloyl)piperidin-4-yl)acetic acid::CHEMBL392748
SMILES COc1cccc2c(c[nH]c12)C1CCN(CC1)C(C1CCN(CC1)C(=O)\C=C\c1cc(F)c(F)c(F)c1)C(O)=O
InChI Key InChIKey=SRKIQKMKVFXDIL-AATRIKPKSA-N
Data  1 IC50
  Tab Delimited (TSV)   2D SDfile   Computed 3D by Vconf -m prep SDfile
Find this compound or compounds like it in BindingDB:
Activity Spreadsheet -- Enzyme Inhibition Constant Data from BindingDB
Found 1 hit for monomerid = 50224501
TargetC-C chemokine receptor type 2(Homo sapiens (Human))
Johnson & Johnson Pharmaceutical Research And Development
Curated by ChEMBL
LigandPNGBDBM50224501((E)-2-(4-(7-methoxy-1H-indol-3-yl)piperidin-1-yl)-...)
Affinity DataIC50:  2.5nM. Assay description: Inhibition of human CCR2
In DepthDetails ArticlePubMed