BDBM50224521 (E)-2-(4-(5-methoxy-1H-indol-3-yl)piperidin-1-yl)-2-(1-(3-(3,4,5-trifluorophenyl)acryloyl)piperidin-4-yl)acetic acid::CHEMBL399617
SMILES COc1ccc2[nH]cc(C3CCN(CC3)C(C3CCN(CC3)C(=O)\C=C\c3cc(F)c(F)c(F)c3)C(O)=O)c2c1
InChI Key InChIKey=OBRQCIZUKFALQE-GORDUTHDSA-N
Data  1 IC50
  Tab Delimited (TSV)   2D SDfile   Computed 3D by Vconf -m prep SDfile
Find this compound or compounds like it in BindingDB:
Activity Spreadsheet -- Enzyme Inhibition Constant Data from BindingDB
Found 1 hit for monomerid = 50224521
TargetC-C chemokine receptor type 2(Homo sapiens (Human))
Johnson & Johnson Pharmaceutical Research And Development
Curated by ChEMBL
LigandPNGBDBM50224521((E)-2-(4-(5-methoxy-1H-indol-3-yl)piperidin-1-yl)-...)
Affinity DataIC50:  16.7nM. Assay description: Inhibition of human CCR2
In DepthDetails ArticlePubMed