BDBM50224789 CHEMBL293962
SMILES COc1ccccc1N1CCN(CCN2C(=O)C(C)CC(C)C2=O)CC1
InChI Key InChIKey=VZZIZGWCQVNQAO-UHFFFAOYSA-N
Data  1 IC50
  Tab Delimited (TSV)   2D SDfile   Computed 3D by Vconf -m prep SDfile
Find this compound or compounds like it in BindingDB:
Activity Spreadsheet -- Enzyme Inhibition Constant Data from BindingDB
Found 1 hit for monomerid = 50224789
TargetD(1A)/D(1B)/D(2)/D(3)/D(4) dopamine receptor(Rattus norvegicus (rat))
TBA
Curated by ChEMBL
LigandPNGBDBM50224789(CHEMBL293962)
Affinity DataIC50: >1.00E+3nM. Assay description: Inhibition of [3H]spiperone binding to dopamine receptor from rat corpus striatal membranes
In DepthDetails ArticlePubMed