BDBM50225240 CHEMBL44501
SMILES [H][C@@]12CCc3ccc(O)cc3C1OCCN2CCC
InChI Key InChIKey=JCSREICEMHWFAY-GICMACPYSA-N
Data  8 IC50
  Tab Delimited (TSV)   2D SDfile   Computed 3D by Vconf -m prep SDfile
Find this compound or compounds like it in BindingDB:
Activity Spreadsheet -- Enzyme Inhibition Constant Data from BindingDB
Found 8 hits for monomerid = 50225240
TargetD(1A)/D(1B)/D(2)/D(3)/D(4) dopamine receptor(Rattus norvegicus (rat))
TBA
Curated by ChEMBL
LigandPNGBDBM50225240(CHEMBL44501)
Affinity DataIC50:  20nM. Assay description: Dopaminergic activity assessed in vitro for displacement of [3H]apomorphine from specific binding sites on rat striatal membranes
In DepthDetails ArticlePubMed
LigandPNGBDBM50225240(CHEMBL44501)
Affinity DataIC50:  116nM. Assay description: Alpha-2 adrenergic receptor activity assessed in vitro for displacement of [3H]clonidine from specific binding sites on rat striatal membranes
In DepthDetails ArticlePubMed
LigandPNGBDBM50225240(CHEMBL44501)
Affinity DataIC50:  6.50E+3nM. Assay description: Alpha-2 adrenergic receptor activity assessed in vitro for displacement of [3H]clonidine from specific binding sites on rat striatal membranes
In DepthDetails ArticlePubMed
TargetD(1A)/D(1B)/D(2)/D(3)/D(4) dopamine receptor(Rattus norvegicus (rat))
TBA
Curated by ChEMBL
LigandPNGBDBM50225240(CHEMBL44501)
Affinity DataIC50:  1.96E+4nM. Assay description: Dopaminergic activity assessed in vitro for displacement of [3H]apomorphine from specific binding sites on rat striatal membranes
In DepthDetails ArticlePubMed
LigandPNGBDBM50225240(CHEMBL44501)
Affinity DataIC50:  1.80E+3nM. Assay description: Alpha-2 adrenergic receptor activity assessed in vitro for displacement of [3H]clonidine from specific binding sites on rat striatal membranes
In DepthDetails ArticlePubMed
LigandPNGBDBM50225240(CHEMBL44501)
Affinity DataIC50:  116nM. Assay description: Alpha-2 adrenergic receptor activity assessed in vitro for displacement of [3H]clonidine from specific binding sites on rat striatal membranes
In DepthDetails ArticlePubMed
TargetD(1A)/D(1B)/D(2)/D(3)/D(4) dopamine receptor(Rattus norvegicus (rat))
TBA
Curated by ChEMBL
LigandPNGBDBM50225240(CHEMBL44501)
Affinity DataIC50:  19.6nM. Assay description: Dopaminergic activity assessed in vitro for displacement of [3H]apomorphine from specific binding sites on rat striatal membranes
In DepthDetails ArticlePubMed
TargetD(1A)/D(1B)/D(2)/D(3)/D(4) dopamine receptor(Rattus norvegicus (rat))
TBA
Curated by ChEMBL
LigandPNGBDBM50225240(CHEMBL44501)
Affinity DataIC50:  2.53E+4nM. Assay description: Dopaminergic activity assessed in vitro for displacement of [3H]apomorphine from specific binding sites on rat striatal membranes
In DepthDetails ArticlePubMed