BDBM50225243 CHEMBL41420
SMILES [H][C@@]12CCc3c(OC)cccc3C1OCCN2CC
InChI Key InChIKey=VQCJVJCKWYCENI-AFYYWNPRSA-N
Data  2 IC50
  Tab Delimited (TSV)   2D SDfile   Computed 3D by Vconf -m prep SDfile
Find this compound or compounds like it in BindingDB:
Activity Spreadsheet -- Enzyme Inhibition Constant Data from BindingDB
Found 2 hits for monomerid = 50225243
LigandPNGBDBM50225243(CHEMBL41420)
Affinity DataIC50:  85nM. Assay description: Alpha-2 adrenergic receptor activity assessed in vitro for displacement of [3H]clonidine from specific binding sites on rat striatal membranes
In DepthDetails ArticlePubMed
TargetD(1A)/D(1B)/D(2)/D(3)/D(4) dopamine receptor(Rattus norvegicus (rat))
TBA
Curated by ChEMBL
LigandPNGBDBM50225243(CHEMBL41420)
Affinity DataIC50:  82nM. Assay description: Dopaminergic activity assessed in vitro for displacement of [3H]apomorphine from specific binding sites on rat striatal membranes
In DepthDetails ArticlePubMed