BDBM50225369 CHEMBL295712
SMILES Fc1ccc(cc1)N(CCCN1CCC2(CC1)N(CNC2=O)c1ccccc1)c1ccc(F)cc1
InChI Key InChIKey=CYWWKZIFXRGVMR-UHFFFAOYSA-N
Data  3 IC50
  Tab Delimited (TSV)   2D SDfile   Computed 3D by Vconf -m prep SDfile
Find this compound or compounds like it in BindingDB:
Activity Spreadsheet -- Enzyme Inhibition Constant Data from BindingDB
Found 3 hits for monomerid = 50225369
TargetAlpha-1A/Alpha-1B/Alpha-1D adrenergic receptor(Rattus norvegicus (rat))
TBA
Curated by ChEMBL
LigandPNGBDBM50225369(CHEMBL295712)
Affinity DataIC50: >1.00E+3nM. Assay description: The compound was tested for inhibition of rabbit plasma renin.
In DepthDetails ArticlePubMed
TargetD(1A)/D(1B)/D(2)/D(3)/D(4) dopamine receptor(Rattus norvegicus (rat))
TBA
Curated by ChEMBL
LigandPNGBDBM50225369(CHEMBL295712)
Affinity DataIC50:  0.610nM. Assay description: Inhibition of [3H]haloperidol binding to dopamine receptors in rat striatal membranes.
In DepthDetails ArticlePubMed
LigandPNGBDBM50225369(CHEMBL295712)
Affinity DataIC50: >100nM. Assay description: The compound was tested for inhibition of [3H]QNB binding to Muscarinic acetylcholine receptor
In DepthDetails ArticlePubMed