BDBM50226228 CHEMBL50137
SMILES COc1cc2nc(nc(N)c2cc1OC)N1CCN(CC1)c1ccncn1
InChI Key InChIKey=ZXTKLTZJLCLMIT-UHFFFAOYSA-N
Data  1 KI
  Tab Delimited (TSV)   2D SDfile   Computed 3D by Vconf -m prep SDfile
Find this compound or compounds like it in BindingDB:
Activity Spreadsheet -- Enzyme Inhibition Constant Data from BindingDB
Found 1 hit for monomerid = 50226228
TargetAlpha-1A/Alpha-1B/Alpha-1D adrenergic receptor(Rattus norvegicus (rat))
Pfizer
Curated by ChEMBL
LigandPNGBDBM50226228(CHEMBL50137)
Affinity DataKi:  0.270nM. Assay description: Binding affinity against alpha-1-adrenoceptor in rat brain homogenates [3H]-prazosin displacement.
In DepthDetails ArticlePubMed