BDBM50227150 2-(4-((3-(3-benzoyl-8-(trifluoromethyl)quinolin-5-yl)phenoxy)methyl)phenyl)-3-(4-tert-butylphenyl)propanoic acid::CHEMBL253730
SMILES CC(C)(C)c1ccc(CC(C(O)=O)c2ccc(COc3cccc(c3)-c3ccc(c4ncc(cc34)C(=O)c3ccccc3)C(F)(F)F)cc2)cc1
InChI Key InChIKey=PGKSRZMWYJNXAT-UHFFFAOYSA-N
Data  2 IC50
  Tab Delimited (TSV)   2D SDfile   Computed 3D by Vconf -m prep SDfile
Find this compound or compounds like it in BindingDB:
Activity Spreadsheet -- Enzyme Inhibition Constant Data from BindingDB
Found 2 hits for monomerid = 50227150
TargetOxysterols receptor LXR-alpha(Homo sapiens (Human))
Wyeth Pharmaceuticals
Curated by ChEMBL
LigandPNGBDBM50227150(2-(4-((3-(3-benzoyl-8-(trifluoromethyl)quinolin-5-...)
Affinity DataIC50:  65nM. Assay description: Binding affinity at human LXRalpha
In DepthDetails ArticlePubMed
TargetOxysterols receptor LXR-beta(Homo sapiens (Human))
Wyeth Pharmaceuticals
Curated by ChEMBL
LigandPNGBDBM50227150(2-(4-((3-(3-benzoyl-8-(trifluoromethyl)quinolin-5-...)
Affinity DataIC50:  81nM. Assay description: Binding affinity at human LXRbeta
In DepthDetails ArticlePubMed