BDBM50227353 CHEMBL51239
SMILES COc1cc(ccc1Cc1cn(Cc2cccc(c2)C#N)c2ccc(NC(=O)CC3CCCC3)cc12)C(=O)NS(=O)(=O)C(C)C
InChI Key InChIKey=FZWBSDKVGGBWAW-UHFFFAOYSA-N
Data  1 KI
  Tab Delimited (TSV)   2D SDfile   Computed 3D by Vconf -m prep SDfile
Find this compound or compounds like it in BindingDB:
Activity Spreadsheet -- Enzyme Inhibition Constant Data from BindingDB
Found 1 hit for monomerid = 50227353
TargetCysteinyl leukotriene receptor 1/2(Homo sapiens (Human))
Ici Pharmaceuticals Group
Curated by ChEMBL
LigandPNGBDBM50227353(CHEMBL51239)
Affinity DataKi:  6.80nM. Assay description: Inhibition constant for displacement of [3H]LTD4 on guinea pig lung parenchymal membranes.
In DepthDetails ArticlePubMed