BDBM50227361 CHEMBL51585
SMILES COc1cc(ccc1Cc1nn(C)c2ccc(NC(=O)OC3CCCC3)cc12)C(=O)NS(=O)(=O)c1ccccc1
InChI Key InChIKey=SKOXHEZNXXKBOY-UHFFFAOYSA-N
Data  1 KI
  Tab Delimited (TSV)   2D SDfile   Computed 3D by Vconf -m prep SDfile
Find this compound or compounds like it in BindingDB:
Activity Spreadsheet -- Enzyme Inhibition Constant Data from BindingDB
Found 1 hit for monomerid = 50227361
TargetCysteinyl leukotriene receptor 1/2(Homo sapiens (Human))
Ici Pharmaceuticals Group
Curated by ChEMBL
LigandPNGBDBM50227361(CHEMBL51585)
Affinity DataKi:  0.25nM. Assay description: Inhibition constant for displacement of [3H]LTD4 on guinea pig lung parenchymal membranes.
In DepthDetails ArticlePubMed