BDBM50227366 CHEMBL48927
SMILES COCCn1cc(Cc2ccc(cc2OC)C(=O)NS(=O)(=O)c2ccccc2)c2cc(NC(=O)OC3CCCC3)ccc12
InChI Key InChIKey=ZYFXZSJLWGWRDB-UHFFFAOYSA-N
Data  1 KI
  Tab Delimited (TSV)   2D SDfile   Computed 3D by Vconf -m prep SDfile
Find this compound or compounds like it in BindingDB:
Activity Spreadsheet -- Enzyme Inhibition Constant Data from BindingDB
Found 1 hit for monomerid = 50227366
TargetCysteinyl leukotriene receptor 1/2(Homo sapiens (Human))
Ici Pharmaceuticals Group
Curated by ChEMBL
LigandPNGBDBM50227366(CHEMBL48927)
Affinity DataKi:  0.200nM. Assay description: Inhibition constant for displacement of [3H]LTD4 on guinea pig lung parenchymal membranes.
In DepthDetails ArticlePubMed