BDBM50229775 (+)-6-[(2-(4-phenylpiperazin-1-yl)ethyl)(propyl)amino]-5,6,7,8-tetrahydronaphthalen-1-ol::(-)-6-[(2-(4-phenylpiperazin-1-yl)ethyl)(propyl)amino]-5,6,7,8-tetrahydronaphthalen-1-ol::6-[(2-(4-phenylpiperazin-1-yl)ethyl)(propyl)amino]-5,6,7,8-tetrahydronaphthalen-1-ol::CHEMBL250552
SMILES CCCN(CCN1CCN(CC1)c1ccccc1)C1CCc2c(O)cccc2C1
InChI Key InChIKey=ACDYFMOSSUKHJD-UHFFFAOYSA-N
Data  6 KI  2 EC50
  Tab Delimited (TSV)   2D SDfile   Computed 3D by Vconf -m prep SDfile
Find this compound or compounds like it in BindingDB:
Activity Spreadsheet -- Enzyme Inhibition Constant Data from BindingDB
Found 8 hits for monomerid = 50229775
TargetD(3) dopamine receptor(Homo sapiens (Human))
Wayne State University
Curated by ChEMBL
LigandPNGBDBM50229775((+)-6-[(2-(4-phenylpiperazin-1-yl)ethyl)(propyl)am...)
Affinity DataKi:  0.800nM. Assay description: Displacement of [3H]spiperone from human cloned dopamine D3 receptor expressed in HEK293 cells
In DepthDetails ArticlePubMed
TargetD(3) dopamine receptor(Homo sapiens (Human))
Wayne State University
Curated by ChEMBL
LigandPNGBDBM50229775((+)-6-[(2-(4-phenylpiperazin-1-yl)ethyl)(propyl)am...)
Affinity DataKi:  0.820nM. Assay description: Displacement of [3H]spiperone from human cloned dopamine D3 receptor expressed in HEK293 cells
In DepthDetails ArticlePubMed
TargetD(3) dopamine receptor(Homo sapiens (Human))
Wayne State University
Curated by ChEMBL
LigandPNGBDBM50229775((+)-6-[(2-(4-phenylpiperazin-1-yl)ethyl)(propyl)am...)
Affinity DataKi:  0.820nM. Assay description: Displacement of [3H]spiperone from human cloned dopamine D3 receptor expressed in HEK293 cells
In DepthDetails ArticlePubMed
TargetD(2) dopamine receptor(Homo sapiens (Human))
Wayne State University
Curated by ChEMBL
LigandPNGBDBM50229775((+)-6-[(2-(4-phenylpiperazin-1-yl)ethyl)(propyl)am...)
Affinity DataKi:  26nM. Assay description: Displacement of [3H]spiperone from human cloned dopamine D2L receptor expressed in HEK293 cells
In DepthDetails ArticlePubMed
TargetD(2) dopamine receptor(Homo sapiens (Human))
Wayne State University
Curated by ChEMBL
LigandPNGBDBM50229775((+)-6-[(2-(4-phenylpiperazin-1-yl)ethyl)(propyl)am...)
Affinity DataKi:  26nM. Assay description: Displacement of [3H]spiperone from human cloned dopamine D2L receptor expressed in HEK293 cells
In DepthDetails ArticlePubMed
TargetD(2) dopamine receptor(Homo sapiens (Human))
Wayne State University
Curated by ChEMBL
LigandPNGBDBM50229775((+)-6-[(2-(4-phenylpiperazin-1-yl)ethyl)(propyl)am...)
Affinity DataKi:  238nM. Assay description: Displacement of [3H]spiperone from human cloned dopamine D2L receptor expressed in HEK293 cells
In DepthDetails ArticlePubMed
TargetD(2) dopamine receptor(Homo sapiens (Human))
Wayne State University
Curated by ChEMBL
LigandPNGBDBM50229775((+)-6-[(2-(4-phenylpiperazin-1-yl)ethyl)(propyl)am...)
Affinity DataEC50:  2.22nM. Assay description: Agonist activity at human cloned dopamine D2L receptor expressed in CHO cells assessed as stimulation of [35S]GTPgammaS binding
In DepthDetails ArticlePubMed
TargetD(3) dopamine receptor(Homo sapiens (Human))
Wayne State University
Curated by ChEMBL
LigandPNGBDBM50229775((+)-6-[(2-(4-phenylpiperazin-1-yl)ethyl)(propyl)am...)
Affinity DataEC50:  0.120nM. Assay description: Agonist activity at human cloned dopamine D3 receptor expressed in AtT-20 cells assessed as stimulation of [35S]GTPgammaS binding
In DepthDetails ArticlePubMed