BDBM50233834 CHEMBL4079052
SMILES CCCCCCCCc1ccc(OCC(=O)Cn2cc(C(=O)CCCOC)c3cc(ccc23)C(O)=O)cc1
InChI Key InChIKey=VDKRIFISHFIRMB-UHFFFAOYSA-N
Data  1 IC50
  Tab Delimited (TSV)   2D SDfile   Computed 3D by Vconf -m prep SDfile
Find this compound or compounds like it in BindingDB:
Activity Spreadsheet -- Enzyme Inhibition Constant Data from BindingDB
Found 1 hit for monomerid = 50233834
TargetCytosolic phospholipase A2(Homo sapiens (Human))
University Of M£Nster
Curated by ChEMBL
LigandPNGBDBM50233834(CHEMBL4079052)
Affinity DataIC50:  15nM. Assay description: Inhibition of human platelet cytosolic phospholipase alpha-2 using 1-stearoyl-2-arachidonoyl-sn-glycero-3-phosphocholine/1,2-dioleoyl-sn-glycerol as ...
In DepthDetails ArticlePubMed