BDBM50237158 CHEMBL4071868
SMILES CCCN(CCCCOc1ccc2c(\C=N\O)cnn2c1)[C@H]1CCc2c(O)cccc2C1
InChI Key InChIKey=HBUKKEFQANLSNF-XLKFHUSGSA-N
Data  6 KI  8 EC50
  Tab Delimited (TSV)   2D SDfile   Computed 3D by Vconf -m prep SDfile
Find this compound or compounds like it in BindingDB:
Activity Spreadsheet -- Enzyme Inhibition Constant Data from BindingDB
Found 14 hits for monomerid = 50237158
TargetD(3) dopamine receptor(Homo sapiens (Human))
Friedrich-Alexander University Erlangen-N£Rnberg
Curated by ChEMBL
LigandPNGBDBM50237158(CHEMBL4071868)
Affinity DataKi:  0.410nM. Assay description: Agonist activity at human Dopamine D3 receptor expressed in HEK293T cell membranes coexpressing GalphaoA incubated for 30 mins measured after 75 mins...
In DepthDetails ArticlePubMed
TargetD(2) dopamine receptor(Homo sapiens (Human))
Friedrich-Alexander University Erlangen-N£Rnberg
Curated by ChEMBL
LigandPNGBDBM50237158(CHEMBL4071868)
Affinity DataKi:  0.840nM. Assay description: Displacement of [3H]spiperone from human Dopamine D2S receptor expressed in CHO cell membranes after 2 hrs by scintillation counting analysis
In DepthDetails ArticlePubMed
TargetD(2) dopamine receptor(Homo sapiens (Human))
Friedrich-Alexander University Erlangen-N£Rnberg
Curated by ChEMBL
LigandPNGBDBM50237158(CHEMBL4071868)
Affinity DataKi:  2.5nM. Assay description: Inhibition of FPP incorporation into biotinylated K-Ras-derived peptide by human farnesyl transferase
In DepthDetails ArticlePubMed
TargetD(4) dopamine receptor(Homo sapiens (Human))
Friedrich-Alexander University Erlangen-N£Rnberg
Curated by ChEMBL
LigandPNGBDBM50237158(CHEMBL4071868)
Affinity DataKi:  6.5nM. Assay description: Displacement of [3H]spiperone from human Dopamine D4 receptor expressed in CHO cell membranes after 2 hrs by scintillation counting analysis
In DepthDetails ArticlePubMed
TargetD(1A) dopamine receptor(Homo sapiens (Human))
Friedrich-Alexander University Erlangen-N£Rnberg
Curated by ChEMBL
LigandPNGBDBM50237158(CHEMBL4071868)
Affinity DataKi:  600nM. Assay description: Displacement of [3H]SCH23390 from human Dopamine D1 receptor expressed in HEK293T cell membranes after 2 hrs by scintillation counting analysis
In DepthDetails ArticlePubMed
Target5-hydroxytryptamine receptor 2A(Homo sapiens (Human))
Friedrich-Alexander University Erlangen-N£Rnberg
Curated by ChEMBL
LigandPNGBDBM50237158(CHEMBL4071868)
Affinity DataKi:  880nM. Assay description: Displacement of [3H]ketanserin from human 5-HT2A receptor expressed in HEK293T cell membranes after 2 hrs by scintillation counting analysis
In DepthDetails ArticlePubMed
TargetD(2) dopamine receptor(Homo sapiens (Human))
Friedrich-Alexander University Erlangen-N£Rnberg
Curated by ChEMBL
LigandPNGBDBM50237158(CHEMBL4071868)
Affinity DataEC50:  13nM. Assay description: Agonist activity at N-terminal flag-tagged D2S receptor (unknown origin) expressed in HEK293 cells assessed as induction of renilla luciferase 2-tagg...
In DepthDetails ArticlePubMed
TargetD(2) dopamine receptor(Homo sapiens (Human))
Friedrich-Alexander University Erlangen-N£Rnberg
Curated by ChEMBL
LigandPNGBDBM50237158(CHEMBL4071868)
Affinity DataEC50:  0.390nM. Assay description: Agonist activity at N-terminal flag-tagged D2S receptor (unknown origin) expressed in HEK293 cells coexpressing renilla luciferase 2-tagged Galphai1 ...
In DepthDetails ArticlePubMed
TargetD(2) dopamine receptor(Homo sapiens (Human))
Friedrich-Alexander University Erlangen-N£Rnberg
Curated by ChEMBL
LigandPNGBDBM50237158(CHEMBL4071868)
Affinity DataEC50:  0.940nM. Assay description: Agonist activity at N-terminal flag-tagged D2S receptor (unknown origin) expressed in HEK293 cells coexpressing renilla luciferase 2-tagged Galphai3 ...
In DepthDetails ArticlePubMed
TargetD(2) dopamine receptor(Homo sapiens (Human))
Friedrich-Alexander University Erlangen-N£Rnberg
Curated by ChEMBL
LigandPNGBDBM50237158(CHEMBL4071868)
Affinity DataEC50:  0.160nM. Assay description: Agonist activity at N-terminal flag-tagged D2S receptor (unknown origin) expressed in HEK293 cells coexpressing renilla luciferase 2-tagged GalphaoB ...
In DepthDetails ArticlePubMed
TargetD(2) dopamine receptor(Homo sapiens (Human))
Friedrich-Alexander University Erlangen-N£Rnberg
Curated by ChEMBL
LigandPNGBDBM50237158(CHEMBL4071868)
Affinity DataEC50:  0.190nM. Assay description: Concentration required for the inhibitory activity against human Farnesyltransferase
In DepthDetails ArticlePubMed
TargetD(2) dopamine receptor(Homo sapiens (Human))
Friedrich-Alexander University Erlangen-N£Rnberg
Curated by ChEMBL
LigandPNGBDBM50237158(CHEMBL4071868)
Affinity DataEC50:  0.600nM. Assay description: Concentration required for the inhibitory activity against human Farnesyltransferase
In DepthDetails ArticlePubMed
TargetD(2) dopamine receptor(Homo sapiens (Human))
Friedrich-Alexander University Erlangen-N£Rnberg
Curated by ChEMBL
LigandPNGBDBM50237158(CHEMBL4071868)
Affinity DataEC50:  12nM. Assay description: Agonist activity at N-terminal flag-tagged D2S receptor (unknown origin) expressed in HEK293 cells assessed as induction of renilla luciferase 2-tagg...
In DepthDetails ArticlePubMed
TargetD(2) dopamine receptor(Homo sapiens (Human))
Friedrich-Alexander University Erlangen-N£Rnberg
Curated by ChEMBL
LigandPNGBDBM50237158(CHEMBL4071868)
Affinity DataEC50:  1.5nM. Assay description: Agonist activity at ARMS2-PK2 tagged D2S receptor (unknown origin) expressed in HEK293 cells assessed as induction of EA-tagged beta-arrestin-2 recru...
In DepthDetails ArticlePubMed